Roller Sports

Rollerskiing
type: Concept
in scheme: scheme
change note:
  creator: Admin Istrator
  modified: 2021-03-24T12:54:43+00:00
definition: Roller skiing is an off-snow equivalent to cross-country skiing that takes place on smooth surfaces such as paths in parks, safe roads and cycle tracks.
notation: rollerskiing