Lifesaving Sport
type: Concept
top concept of: scheme
in scheme: scheme
definition: Lifesaving Sport is a competitive sport that gives you the opportunity to compete with fellow lifesavers and grow your essential lifesaving skills.
notation: lifesaving_sport